Reaction Details
TargetThymidine kinase, cytosolic
LigandBDBM50131909
Substrate/Competitorn/a
Meas. Tech.ChEMBL_208213 (CHEMBL815478)
Ki 220000±n/a nM
Citation Vanheusden, VMunier-Lehmann, HFroeyen, MDugué, LHeyerick, ADe Keukeleire, DPochet, SBusson, RHerdewijn, PVan Calenbergh, S 3'-C-branched-chain-substituted nucleosides and nucleotides as potent inhibitors of Mycobacterium tuberculosis thymidine monophosphate kinase. J Med Chem46:3811-21 (2003) 
 
Thymidine kinase, cytosolic
Name:Thymidine kinase, cytosolic
Type:PROTEIN
Mol. Mass.:25476.50
Organism:Homo sapiens (Human)
Description:ChEMBL_1333884
Residue:234
BDBM50131909
NameBDBM50131909
Synonyms:1-((2R,4R,5S)-4-aminomethyl-5-hydroxymethyl-tetrahydro-furan-2-yl)-5-methyl-1H-pyrimidine-2,4-dione CHEMBL341264
TypeSmall organic molecule
Emp. Form.C11H17N3O4
Mol. Mass.255.2704
SMILESCc1cn([C@H]2C[C@H](CN)[C@@H](CO)O2)c(=O)[nH]c1=O