Reaction Details
TargetD(2) dopamine receptor
LigandBDBM50131927
Substrate/Competitorn/a
Meas. Tech.ChEMBL_62233 (CHEMBL675744)
Ki 518±n/a nM
Citation Campiani, GButini, STrotta, FFattorusso, CCatalanotti, BAiello, FGemma, SNacci, VNovellino, EStark, JACagnotto, AFumagalli, ECarnovali, FCervo, LMennini, T Synthesis and pharmacological evaluation of potent and highly selective D3 receptor ligands: inhibition of cocaine-seeking behavior and the role of dopamine D3/D2 receptors. J Med Chem46:3822-39 (2003) 
 
D(2) dopamine receptor
Name:D(2) dopamine receptor
Type:G Protein-Coupled Receptor (GPCR)
Mol. Mass.:50931.60
Organism:Rattus norvegicus (rat)
Description:P61169
Residue:444
BDBM50131927
NameBDBM50131927
Synonyms:(2-Benzofuran-2-yl-oxazol-4-ylmethyl)-{2-[4-(2-methoxy-phenyl)-piperazin-1-yl]-ethyl}-amine | CHEMBL341117
TypeSmall organic molecule
Emp. Form.C25H28N4O3
Mol. Mass.432.5148
SMILESCOc1ccccc1N1CCN(CCNCc2coc(n2)-c2cc3ccccc3o2)CC1