Reaction Details
TargetAlpha-1A adrenergic receptor
LigandBDBM50131930
Substrate/Competitorn/a
Meas. Tech.ChEMBL_33275 (CHEMBL643613)
Ki 8100±n/a nM
Citation Campiani, GButini, STrotta, FFattorusso, CCatalanotti, BAiello, FGemma, SNacci, VNovellino, EStark, JACagnotto, AFumagalli, ECarnovali, FCervo, LMennini, T Synthesis and pharmacological evaluation of potent and highly selective D3 receptor ligands: inhibition of cocaine-seeking behavior and the role of dopamine D3/D2 receptors. J Med Chem46:3822-39 (2003) 
 
Alpha-1A adrenergic receptor
Name:Alpha-1A adrenergic receptor
Type:Protein
Mol. Mass.:51620.15
Organism:Rattus norvegicus (Rat)
Description:P43140
Residue:466
BDBM50131930
NameBDBM50131930
Synonyms:5-Chloro-1H-indole-2-carboxylic acid {4-[4-(2,4-dichloro-phenyl)-piperazin-1-yl]-butyl}-amide CHEMBL126889
TypeSmall organic molecule
Emp. Form.C23H25Cl3N4O
Mol. Mass.479.83
SMILESClc1ccc(N2CCN(CCCCNC(=O)c3cc4cc(Cl)ccc4[nH]3)CC2)c(Cl)c1