Reaction Details
TargetAlpha-2A adrenergic receptor [16-465]
LigandBDBM50131923
Substrate/Competitorn/a
Meas. Tech.ChEMBL_32765 (CHEMBL643710)
Ki 1887±n/a nM
Citation Campiani, GButini, STrotta, FFattorusso, CCatalanotti, BAiello, FGemma, SNacci, VNovellino, EStark, JACagnotto, AFumagalli, ECarnovali, FCervo, LMennini, T Synthesis and pharmacological evaluation of potent and highly selective D3 receptor ligands: inhibition of cocaine-seeking behavior and the role of dopamine D3/D2 receptors. J Med Chem46:3822-39 (2003) 
 
Alpha-2A adrenergic receptor [16-465]
Name:Alpha-2A adrenergic receptor [16-465]
Type:G-protein coupled receptor
Mol. Mass.:48961.69
Organism:Rattus norvegicus (rat)
Description:P22909[16-465]
Residue:450
BDBM50131923
NameBDBM50131923
Synonyms:Benzofuran-2-carboxylic acid {4-[4-(2,4-dichloro-phenyl)-piperazin-1-yl]-butyl}-amide | CHEMBL435218
TypeSmall organic molecule
Emp. Form.C23H25Cl2N3O2
Mol. Mass.446.37
SMILESClc1ccc(N2CCN(CCCCNC(=O)c3cc4ccccc4o3)CC2)c(Cl)c1