Reaction Details
TargetAlpha-1A adrenergic receptor
LigandBDBM50131925
Substrate/Competitorn/a
Meas. Tech.ChEMBL_33275 (CHEMBL643613)
Ki 547±n/a nM
Citation Campiani, GButini, STrotta, FFattorusso, CCatalanotti, BAiello, FGemma, SNacci, VNovellino, EStark, JACagnotto, AFumagalli, ECarnovali, FCervo, LMennini, T Synthesis and pharmacological evaluation of potent and highly selective D3 receptor ligands: inhibition of cocaine-seeking behavior and the role of dopamine D3/D2 receptors. J Med Chem46:3822-39 (2003) 
 
Alpha-1A adrenergic receptor
Name:Alpha-1A adrenergic receptor
Type:Protein
Mol. Mass.:51620.15
Organism:Rattus norvegicus (Rat)
Description:P43140
Residue:466
BDBM50131925
NameBDBM50131925
Synonyms:1H-Indole-2-carboxylic acid {4-[4-(2,4-dichloro-phenyl)-piperazin-1-yl]-butyl}-amide N-(4-(4-(2,4-dichlorophenyl)piperazin-1-yl)butyl)-1H-indole-2-carboxamide
TypeSmall organic molecule
Emp. Form.C23H26Cl2N4O
Mol. Mass.445.385
SMILESClc1ccc(N2CCN(CCCCNC(=O)c3cc4ccccc4[nH]3)CC2)c(Cl)c1