Reaction Details
Target5-hydroxytryptamine receptor 1A
LigandBDBM50131920
Substrate/Competitorn/a
Meas. Tech.ChEMBL_1092 (CHEMBL616415)
Ki 4.9±n/a nM
Citation Campiani, GButini, STrotta, FFattorusso, CCatalanotti, BAiello, FGemma, SNacci, VNovellino, EStark, JACagnotto, AFumagalli, ECarnovali, FCervo, LMennini, T Synthesis and pharmacological evaluation of potent and highly selective D3 receptor ligands: inhibition of cocaine-seeking behavior and the role of dopamine D3/D2 receptors. J Med Chem46:3822-39 (2003) 
 
5-hydroxytryptamine receptor 1A
Name:5-hydroxytryptamine receptor 1A
Type:G Protein-Coupled Receptor (GPCR)
Mol. Mass.:46445.29
Organism:Rattus norvegicus (rat)
Description:Binding assays were performed using rat hippocampal membranes.
Residue:422
BDBM50131920
NameBDBM50131920
Synonyms:2-{4-[4-(2-Methoxy-phenyl)-piperazin-1-yl]-butyl}-3,4-dihydro-2H-pyrazino[1,2-a]indol-1-one | CHEMBL420510
TypeSmall organic molecule
Emp. Form.C26H32N4O2
Mol. Mass.432.5579
SMILESCOc1ccccc1N1CCN(CCCCN2CCn3c(cc4ccccc34)C2=O)CC1