Reaction Details
TargetD(2) dopamine receptor
LigandBDBM50119380
Substrate/Competitorn/a
Meas. Tech.ChEMBL_62233 (CHEMBL675744)
Ki 61±n/a nM
Citation Campiani, GButini, STrotta, FFattorusso, CCatalanotti, BAiello, FGemma, SNacci, VNovellino, EStark, JACagnotto, AFumagalli, ECarnovali, FCervo, LMennini, T Synthesis and pharmacological evaluation of potent and highly selective D3 receptor ligands: inhibition of cocaine-seeking behavior and the role of dopamine D3/D2 receptors. J Med Chem46:3822-39 (2003) 
 
D(2) dopamine receptor
Name:D(2) dopamine receptor
Type:G Protein-Coupled Receptor (GPCR)
Mol. Mass.:50931.60
Organism:Rattus norvegicus (rat)
Description:P61169
Residue:444
BDBM50119380
NameBDBM50119380
Synonyms:CHEMBL25236 N-(4-(4-(2-methoxyphenyl)piperazin-1-yl)butyl)-2-naphthamide | Naphthalene-2-carboxylic acid {4-[4-(2-methoxy-phenyl)-piperazin-1-yl]-butyl}-amide
TypeSmall organic molecule
Emp. Form.C26H31N3O2
Mol. Mass.417.5432
SMILESCOc1ccccc1N1CCN(CCCCNC(=O)c2ccc3ccccc3c2)CC1