Reaction Details
TargetStromelysin-1
LigandBDBM50131949
Substrate/Competitorn/a
Meas. Tech.ChEMBL_104732 (CHEMBL874161)
IC50 9.4±n/a nM
Citation Le Diguarher, TChollet, AMBertrand, MHennig, PRaimbaud, ESabatini, MGuilbaud, NPierré, ATucker, GCCasara, P Stereospecific synthesis of 5-substituted 2-bisarylthiocyclopentane carboxylic acids as specific matrix metalloproteinase inhibitors. J Med Chem46:3840-52 (2003) 
 
Stromelysin-1
Name:Stromelysin-1
Type:Enzyme
Mol. Mass.:53973.13
Organism:Homo sapiens (Human)
Description: P08254
Residue:477
BDBM50131949
NameBDBM50131949
Synonyms:2-(4'-Chloro-biphenyl-4-ylsulfanyl)-5-(4,4-dimethyl-2,5-dioxo-imidazolidin-1-ylmethyl)-cyclopentanecarboxylic acid | CHEMBL126712
TypeSmall organic molecule
Emp. Form.C24H25ClN2O4S
Mol. Mass.472.984
SMILESCC1(C)NC(=O)N(C[C@@H]2CC[C@H](Sc3ccc(cc3)-c3ccc(Cl)cc3)[C@H]2C(O)=O)C1=O