Reaction Details
TargetStromelysin-1
LigandBDBM50131952
Substrate/Competitorn/a
Meas. Tech.ChEMBL_104732 (CHEMBL874161)
IC50 3±n/a nM
Citation Le Diguarher, TChollet, AMBertrand, MHennig, PRaimbaud, ESabatini, MGuilbaud, NPierré, ATucker, GCCasara, P Stereospecific synthesis of 5-substituted 2-bisarylthiocyclopentane carboxylic acids as specific matrix metalloproteinase inhibitors. J Med Chem46:3840-52 (2003) 
 
Stromelysin-1
Name:Stromelysin-1
Type:Enzyme
Mol. Mass.:53973.13
Organism:Homo sapiens (Human)
Description: P08254
Residue:477
BDBM50131952
NameBDBM50131952
Synonyms:2-(Biphenyl-4-ylmethylsulfanyl)-5-(1,3-dioxo-1,3-dihydro-isoindol-2-ylmethyl)-cyclopentanecarboxylic acid | CHEMBL125104
TypeSmall organic molecule
Emp. Form.C28H25NO4S
Mol. Mass.471.567
SMILESOC(=O)[C@H]1[C@H](CN2C(=O)c3ccccc3C2=O)CC[C@@H]1SCc1ccc(cc1)-c1ccccc1