Reaction Details
Target72 kDa type IV collagenase
LigandBDBM50131937
Substrate/Competitorn/a
Meas. Tech.ChEMBL_104390 (CHEMBL714993)
IC50 63.0±n/a nM
Citation Le Diguarher, TChollet, AMBertrand, MHennig, PRaimbaud, ESabatini, MGuilbaud, NPierré, ATucker, GCCasara, P Stereospecific synthesis of 5-substituted 2-bisarylthiocyclopentane carboxylic acids as specific matrix metalloproteinase inhibitors. J Med Chem46:3840-52 (2003) 
 
72 kDa type IV collagenase
Name:72 kDa type IV collagenase
Type:Enzyme
Mol. Mass.:73870.36
Organism:Homo sapiens (Human)
Description: P08253
Residue:660
BDBM50131937
NameBDBM50131937
Synonyms:2-(4'-Chloro-biphenyl-4-ylsulfanyl)-5-(4-oxo-4H-benzo[d][1,2,3]triazin-3-ylmethyl)-cyclopentanecarboxylic acid | CHEMBL126380
TypeSmall organic molecule
Emp. Form.C26H22ClN3O3S
Mol. Mass.491.989
SMILESOC(=O)[C@H]1[C@H](Cn2nnc3ccccc3c2=O)CC[C@@H]1Sc1ccc(cc1)-c1ccc(Cl)cc1