Reaction Details
TargetInterstitial collagenase
LigandBDBM50131962
Substrate/Competitorn/a
Meas. Tech.ChEMBL_106113 (CHEMBL713706)
IC50>100000±n/a nM
Citation Le Diguarher, TChollet, AMBertrand, MHennig, PRaimbaud, ESabatini, MGuilbaud, NPierré, ATucker, GCCasara, P Stereospecific synthesis of 5-substituted 2-bisarylthiocyclopentane carboxylic acids as specific matrix metalloproteinase inhibitors. J Med Chem46:3840-52 (2003) 
 
Interstitial collagenase
Name:Interstitial collagenase
Type:Enzyme
Mol. Mass.:54010.26
Organism:Homo sapiens (Human)
Description: P03956
Residue:469
BDBM50131962
NameBDBM50131962
Synonyms:2-(4'-Chloro-biphenyl-4-sulfonyl)-5-(4-oxo-4H-benzo[d][1,2,3]triazin-3-ylmethyl)-cyclopentanecarboxylic acid | CHEMBL341249
TypeSmall organic molecule
Emp. Form.C26H22ClN3O5S
Mol. Mass.523.988
SMILESOC(=O)[C@H]1[C@H](Cn2nnc3ccccc3c2=O)CC[C@@H]1S(=O)(=O)c1ccc(cc1)-c1ccc(Cl)cc1