Reaction Details
TargetInterstitial collagenase
LigandBDBM8465
Substrate/Competitorn/a
Meas. Tech.ChEMBL_106113 (CHEMBL713706)
IC50 96±n/a nM
Citation Le Diguarher, TChollet, AMBertrand, MHennig, PRaimbaud, ESabatini, MGuilbaud, NPierré, ATucker, GCCasara, P Stereospecific synthesis of 5-substituted 2-bisarylthiocyclopentane carboxylic acids as specific matrix metalloproteinase inhibitors. J Med Chem46:3840-52 (2003) 
 
Interstitial collagenase
Name:Interstitial collagenase
Type:Enzyme
Mol. Mass.:54010.26
Organism:Homo sapiens (Human)
Description: P03956
Residue:469
BDBM8465
NameBDBM8465
Synonyms:(2R)-N-hydroxy-2-[(4-methoxybenzene)(pyridin-3-ylmethyl)sulfonamido]-3-methylbutanamide CGS 27023 CHEMBL514138 | hydroxamate analogue 1
TypeSmall organic molecule
Emp. Form.C18H23N3O5S
Mol. Mass.393.457
SMILESCOc1ccc(cc1)S(=O)(=O)N(Cc1cccnc1)[C@H](C(C)C)C(=O)NO