Reaction Details
TargetKappa-type opioid receptor
LigandBDBM50131971
Substrate/Competitorn/a
Meas. Tech.ChEMBL_145417 (CHEMBL747228)
Ki 4.4±n/a nM
Citation Anzini, MCanullo, LBraile, CCappelli, AGallelli, AVomero, SMenziani, MCDe Benedetti, PGRizzo, MCollina, SAzzolina, OSbacchi, MGhelardini, CGaleotti, N Synthesis, biological evaluation, and receptor docking simulations of 2-[(acylamino)ethyl]-1,4-benzodiazepines as kappa-opioid receptor agonists endowed with antinociceptive and antiamnesic activity. J Med Chem46:3853-64 (2003) 
 
Kappa-type opioid receptor
Name:Kappa-type opioid receptor
Type:G Protein-Coupled Receptor (GPCR)
Mol. Mass.:42648.76
Organism:Homo sapiens (Human)
Description:P41145
Residue:380
BDBM50131971
NameBDBM50131971
Synonyms:CHEMBL338393 | Thiophene-2-carboxylic acid methyl-[2-(1-methyl-5-phenyl-2,3-dihydro-1H-benzo[e][1,4]diazepin-2-yl)-ethyl]-amide
TypeSmall organic molecule
Emp. Form.C24H25N3OS
Mol. Mass.403.54
SMILESCN(CCC1CN=C(c2ccccc2)c2ccccc2N1C)C(=O)c1cccs1