Reaction Details
TargetKappa-type opioid receptor
LigandBDBM50027054
Substrate/Competitorn/a
Meas. Tech.ChEMBL_145244 (CHEMBL755694)
Ki 0.710000±n/a nM
Citation Anzini, MCanullo, LBraile, CCappelli, AGallelli, AVomero, SMenziani, MCDe Benedetti, PGRizzo, MCollina, SAzzolina, OSbacchi, MGhelardini, CGaleotti, N Synthesis, biological evaluation, and receptor docking simulations of 2-[(acylamino)ethyl]-1,4-benzodiazepines as kappa-opioid receptor agonists endowed with antinociceptive and antiamnesic activity. J Med Chem46:3853-64 (2003) 
 
Kappa-type opioid receptor
Name:Kappa-type opioid receptor
Type:G Protein-Coupled Receptor (GPCR)
Mol. Mass.:42648.76
Organism:Homo sapiens (Human)
Description:P41145
Residue:380
BDBM50027054
NameBDBM50027054
Synonyms:CHEMBL2448130
TypeSmall organic molecule
Emp. Form.C23H22FN3OS
Mol. Mass.407.504
SMILESCN1[C@H](CCNC(=O)c2ccsc2)CN=C(c2ccccc2F)c2ccccc12