Reaction Details
TargetKappa-type opioid receptor
LigandBDBM50049801
Substrate/Competitorn/a
Meas. Tech.ChEMBL_145417 (CHEMBL747228)
Ki 1.3±n/a nM
Citation Anzini, MCanullo, LBraile, CCappelli, AGallelli, AVomero, SMenziani, MCDe Benedetti, PGRizzo, MCollina, SAzzolina, OSbacchi, MGhelardini, CGaleotti, N Synthesis, biological evaluation, and receptor docking simulations of 2-[(acylamino)ethyl]-1,4-benzodiazepines as kappa-opioid receptor agonists endowed with antinociceptive and antiamnesic activity. J Med Chem46:3853-64 (2003) 
 
Kappa-type opioid receptor
Name:Kappa-type opioid receptor
Type:G Protein-Coupled Receptor (GPCR)
Mol. Mass.:42648.76
Organism:Homo sapiens (Human)
Description:P41145
Residue:380
BDBM50049801
NameBDBM50049801
Synonyms:4-Chloro-N-[2-(7-chloro-1-methyl-5-phenyl-2,3-dihydro-1H-benzo[e][1,4]diazepin-2-yl)-ethyl]-benzamide | CHEMBL340001
TypeSmall organic molecule
Emp. Form.C25H23Cl2N3O
Mol. Mass.452.376
SMILESCN1C(CCNC(=O)c2ccc(Cl)cc2)CN=C(c2ccccc2)c2cc(Cl)ccc12