Reaction Details
TargetKappa-type opioid receptor
LigandBDBM50381677
Substrate/Competitorn/a
Meas. Tech.ChEMBL_146382 (CHEMBL754739)
Ki 1.9±n/a nM
Citation Anzini, MCanullo, LBraile, CCappelli, AGallelli, AVomero, SMenziani, MCDe Benedetti, PGRizzo, MCollina, SAzzolina, OSbacchi, MGhelardini, CGaleotti, N Synthesis, biological evaluation, and receptor docking simulations of 2-[(acylamino)ethyl]-1,4-benzodiazepines as kappa-opioid receptor agonists endowed with antinociceptive and antiamnesic activity. J Med Chem46:3853-64 (2003) 
 
Kappa-type opioid receptor
Name:Kappa-type opioid receptor
Type:G Protein-Coupled Receptor (GPCR)
Mol. Mass.:42744.99
Organism:Cavia porcellus (domestic guinea pig)
Description:P41144
Residue:380
BDBM50381677
NameBDBM50381677
Synonyms:CHEMBL1256748 | U-69593
TypeSmall organic molecule
Emp. Form.C22H32N2O2
Mol. Mass.356.5017
SMILESCN([C@H]1C[C@@]2(CCCO2)CC[C@@H]1N1CCCC1)C(=O)Cc1ccccc1