Reaction Details
TargetMO15-related protein kinase Pfmrk
LigandBDBM5718
Substrate/Competitorn/a
Meas. Tech.ChEMBL_52684 (CHEMBL666139)
IC50>1000000±n/a nM
Citation Woodard, CLLi, ZKathcart, AKTerrell, JGerena, LLopez-Sanchez, MKyle, DEBhattacharjee, AKNichols, DAEllis, WPrigge, STGeyer, JAWaters, NC Oxindole-based compounds are selective inhibitors of Plasmodium falciparum cyclin dependent protein kinases. J Med Chem46:3877-82 (2003) 
 
MO15-related protein kinase Pfmrk
Name:MO15-related protein kinase Pfmrk
Synonyms:Protein kinase Pfmrk
Type:PROTEIN
Mol. Mass.:37992.30
Organism:Plasmodium falciparum
Description:ChEMBL_640752
Residue:324
BDBM5718
NameBDBM5718
TypeSmall organic molecule
Emp. Form.C15H18N6O
Mol. Mass.298.343
SMILESCn1cnc2c(NCc3ccccc3)nc(NCCO)nc12