Reaction Details
TargetHydroxycarboxylic acid receptor 2
LigandBDBM50132133
Substrate/Competitorn/a
Meas. Tech.ChEMBL_144336 (CHEMBL751847)
Ki 37900±n/a nM
Citation van Herk, TBrussee, Jvan den Nieuwendijk, AMvan der Klein, PAIJzerman, APStannek, CBurmeister, ALorenzen, A Pyrazole derivatives as partial agonists for the nicotinic acid receptor. J Med Chem46:3945-51 (2003) 
 
Hydroxycarboxylic acid receptor 2
Name:Hydroxycarboxylic acid receptor 2
Type:PROTEIN
Mol. Mass.:41476.06
Organism:Rattus norvegicus
Description:ChEMBL_820675
Residue:360
BDBM50132133
NameBDBM50132133
Synonyms:5-p-Tolyl-1H-pyrazole-3-carboxylic acid cid_818267
TypeSmall organic molecule
Emp. Form.C11H10N2O2
Mol. Mass.202.2093
SMILESCc1ccc(cc1)-c1cc([nH]n1)C(O)=O