Reaction Details
TargetHydroxycarboxylic acid receptor 2
LigandBDBM50132149
Substrate/Competitorn/a
Meas. Tech.ChEMBL_144336 (CHEMBL751847)
Ki 63700±n/a nM
Citation van Herk, TBrussee, Jvan den Nieuwendijk, AMvan der Klein, PAIJzerman, APStannek, CBurmeister, ALorenzen, A Pyrazole derivatives as partial agonists for the nicotinic acid receptor. J Med Chem46:3945-51 (2003) 
 
Hydroxycarboxylic acid receptor 2
Name:Hydroxycarboxylic acid receptor 2
Type:PROTEIN
Mol. Mass.:41476.06
Organism:Rattus norvegicus
Description:ChEMBL_820675
Residue:360
BDBM50132149
NameBDBM50132149
Synonyms:5-(3-Chloro-phenyl)-1H-pyrazole-3-carboxylic acid | CHEMBL338017
TypeSmall organic molecule
Emp. Form.C10H7ClN2O2
Mol. Mass.222.628
SMILESOC(=O)c1cc(n[nH]1)-c1cccc(Cl)c1