Reaction Details
TargetHistamine H3 receptor
LigandBDBM50133003
Substrate/Competitorn/a
Meas. Tech.ChEMBL_83644 (CHEMBL693106)
Ki 25±n/a nM
Citation Jablonowski, JAGrice, CAChai, WDvorak, CAVenable, JDKwok, AKLy, KSWei, JBaker, SMDesai, PJJiang, WWilson, SJThurmond, RLKarlsson, LEdwards, JPLovenberg, TWCarruthers, NI The first potent and selective non-imidazole human histamine H4 receptor antagonists. J Med Chem46:3957-60 (2003) 
 
Histamine H3 receptor
Name:Histamine H3 receptor
Type:G Protein-Coupled Receptor (GPCR)
Mol. Mass.:48691.47
Organism:Homo sapiens (Human)
Description:Binding assays were using CHO cells stably expressing hH3R receptors.
Residue:445
BDBM50133003
NameBDBM50133003
Synonyms:4-(3-(piperidin-1-yl)propoxy)benzonitrile CHEMBL129257 | UCL-2138
TypeSmall organic molecule
Emp. Form.C15H20N2O
Mol. Mass.244.3321
SMILESN#Cc1ccc(OCCCN2CCCCC2)cc1