Reaction Details
TargetGlycogen synthase kinase-3 beta
LigandBDBM50133064
Substrate/Competitorn/a
Meas. Tech.ChEMBL_71153 (CHEMBL684979)
IC50 34±n/a nM
Citation Kuo, GHProuty, CDeAngelis, AShen, LO'Neill, DJShah, CConnolly, PJMurray, WVConway, BRCheung, PWestover, LXu, JZLook, RADemarest, KTEmanuel, SMiddleton, SAJolliffe, LBeavers, MPChen, X Synthesis and discovery of macrocyclic polyoxygenated bis-7-azaindolylmaleimides as a novel series of potent and highly selective glycogen synthase kinase-3beta inhibitors. J Med Chem46:4021-31 (2003) 
 
Glycogen synthase kinase-3 beta
Name:Glycogen synthase kinase-3 beta
Type:Enzyme
Mol. Mass.:46756.38
Organism:Homo sapiens (Human)
Description:P49841
Residue:420
BDBM50133064
NameBDBM50133064
Synonyms:17,20,23-trioxa-4,12,14,26,28-pentaazahexacyclo[24.6.1.17,14.02,6.08,13.027,32]tetratriaconta-1(33),2(6),7(34),8,10,12,27,29,31-nonaene-3,5-dione | CHEMBL340776
TypeSmall organic molecule
Emp. Form.C26H25N5O5
Mol. Mass.487.5072
SMILESO=C1NC(=O)C2=C1c1cn(CCOCCOCCOCCn3cc2c2cccnc32)c2ncccc12