Reaction Details
TargetCoagulation factor X
LigandBDBM50130063
Substrate/Competitorn/a
Meas. Tech.ChEMBL_48634 (CHEMBL659615)
IC50 27±n/a nM
Citation Parlow, JJDice, TALachance, RMGirard, TJStevens, AMStegeman, RAStallings, WCKurumbail, RGSouth, MS Polymer-assisted solution-phase library synthesis and crystal structure of alpha-ketothiazoles as tissue factor VIIa inhibitors. J Med Chem46:4043-9 (2003) 
 
Coagulation factor X
Name:Coagulation factor X
Type:Enzyme
Mol. Mass.:54726.60
Organism:Homo sapiens (Human)
Description:n/a
Residue:488
BDBM50130063
NameBDBM50130063
Synonyms:(R)-N-{(S)-1-[(S)-4-Guanidino-1-(thiazole-2-carbonyl)-butylcarbamoyl]-2-phenyl-ethyl}-3-phenyl-2-phenylmethanesulfonylamino-propionamide CHEMBL78055
TypeSmall organic molecule
Emp. Form.C34H39N7O5S2
Mol. Mass.689.847
SMILESNC(=N)NCCC[C@H](NC(=O)[C@H](Cc1ccccc1)NC(=O)[C@@H](Cc1ccccc1)NS(=O)(=O)Cc1ccccc1)C(=O)c1nccs1