Reaction Details
TargetDelta-type opioid receptor
LigandBDBM50133226
Substrate/Competitorn/a
Meas. Tech.ChEMBL_146916 (CHEMBL757504)
Ki 0.2±n/a nM
Citation Schütz, JSpetea, MKoch, MAceto, MDHarris, LSCoop, ASchmidhammer, H Synthesis and biological evaluation of 14-alkoxymorphinans. 20. 14-phenylpropoxymetopon: an extremely powerful analgesic. J Med Chem46:4182-7 (2003) 
 
Delta-type opioid receptor
Name:Delta-type opioid receptor
Type:G Protein-Coupled Receptor (GPCR)
Mol. Mass.:40465.04
Organism:Rattus norvegicus (rat)
Description:Competition binding assays were using CHO-K1 cell membranes expressing the opioid receptor.
Residue:372
BDBM50133226
NameBDBM50133226
Synonyms:15-methoxy-3-methyl-19-(1-methylbutyl)-13-oxa-3-azahexacyclo[13.2.2.12,8.01,6.06,14.07,12]icosa-7,9,11,16-tetraene | CHEMBL133836
TypeSmall organic molecule
Emp. Form.C25H33NO2
Mol. Mass.379.535
SMILESCCC[C@H](C)C1C[C@]23C=C[C@]1(OC)[C@@H]1Oc4cccc5C[C@H]2N(C)CC[C@@]31c45