Reaction Details
Target5-hydroxytryptamine receptor 1A
LigandBDBM50014945
Substrate/Competitorn/a
Meas. Tech.ChEMBL_2258 (CHEMBL617484)
Ki 12±n/a nM
Citation May, JAChen, HHRusinko, ALynch, VMSharif, NAMcLaughlin, MA A novel and selective 5-HT2 receptor agonist with ocular hypotensive activity: (S)-(+)-1-(2-aminopropyl)-8,9-dihydropyrano[3,2-e]indole. J Med Chem46:4188-95 (2003) 
 
5-hydroxytryptamine receptor 1A
Name:5-hydroxytryptamine receptor 1A
Type:n/a
Mol. Mass.:46122.49
Organism:Homo sapiens (Human)
Description:n/a
Residue:422
BDBM50014945
NameBDBM50014945
Synonyms:3-(2-aminopropyl)-1H-indol-5-ol alpha-M-5-HT alpha-methyl-5-hydroxytryptamine | alpha-methylserotonin
TypeSmall organic molecule
Emp. Form.C11H14N2O
Mol. Mass.190.2417
SMILESCC(N)Cc1c[nH]c2ccc(O)cc12