Reaction Details
Target5-hydroxytryptamine receptor 2B
LigandBDBM50003039
Substrate/Competitorn/a
Meas. Tech.ChEMBL_2871 (CHEMBL617774)
Ki 14±n/a nM
Citation May, JAChen, HHRusinko, ALynch, VMSharif, NAMcLaughlin, MA A novel and selective 5-HT2 receptor agonist with ocular hypotensive activity: (S)-(+)-1-(2-aminopropyl)-8,9-dihydropyrano[3,2-e]indole. J Med Chem46:4188-95 (2003) 
 
5-hydroxytryptamine receptor 2B
Name:5-hydroxytryptamine receptor 2B
Type:G Protein-Coupled Receptor (GPCR)
Mol. Mass.:54312.47
Organism:Homo sapiens (Human)
Description:Receptor binding assays were performed using human clone stably expressed in CHO cells.
Residue:481
BDBM50003039
NameBDBM50003039
Synonyms:2-(3,7,8,9-Tetrahydro-pyrano[3,2-e]indol-1-yl)-ethylamine | CHEMBL27173
TypeSmall organic molecule
Emp. Form.C13H16N2O
Mol. Mass.216.2789
SMILESNCCc1c[nH]c2ccc3OCCCc3c12