Reaction Details
Target5-hydroxytryptamine receptor 2C
LigandBDBM50133231
Substrate/Competitorn/a
Meas. Tech.ChEMBL_2727 (CHEMBL617287)
Ki 4±n/a nM
Citation May, JAChen, HHRusinko, ALynch, VMSharif, NAMcLaughlin, MA A novel and selective 5-HT2 receptor agonist with ocular hypotensive activity: (S)-(+)-1-(2-aminopropyl)-8,9-dihydropyrano[3,2-e]indole. J Med Chem46:4188-95 (2003) 
 
5-hydroxytryptamine receptor 2C
Name:5-hydroxytryptamine receptor 2C
Type:G Protein-Coupled Receptor (GPCR)
Mol. Mass.:51836.79
Organism:Homo sapiens (Human)
Description:P28335
Residue:458
BDBM50133231
NameBDBM50133231
Synonyms:(R)-1-(4-iodo-2,5-dimethoxyphenyl)propan-2-amine (R)-2-(4-iodo-2,5-dimethoxyphenyl)-1-methylethylamine | CHEMBL134519
TypeSmall organic molecule
Emp. Form.C11H16INO2
Mol. Mass.321.1547
SMILESCOc1cc(C[C@@H](C)N)c(OC)cc1I