Reaction Details
Target5-hydroxytryptamine receptor 2C
LigandBDBM50133233
Substrate/Competitorn/a
Meas. Tech.ChEMBL_2727 (CHEMBL617287)
Ki 2.7±n/a nM
Citation May, JAChen, HHRusinko, ALynch, VMSharif, NAMcLaughlin, MA A novel and selective 5-HT2 receptor agonist with ocular hypotensive activity: (S)-(+)-1-(2-aminopropyl)-8,9-dihydropyrano[3,2-e]indole. J Med Chem46:4188-95 (2003) 
 
5-hydroxytryptamine receptor 2C
Name:5-hydroxytryptamine receptor 2C
Type:G Protein-Coupled Receptor (GPCR)
Mol. Mass.:51836.79
Organism:Homo sapiens (Human)
Description:P28335
Residue:458
BDBM50133233
NameBDBM50133233
Synonyms:1-Methyl-2-(3-methyl-3,7,8,9-tetrahydro-pyrano[3,2-e]indol-1-yl)-ethylamine | CHEMBL131736
TypeSmall organic molecule
Emp. Form.C15H20N2O
Mol. Mass.244.3321
SMILESCC(N)Cc1cn(C)c2ccc3OCCCc3c12