Reaction Details
TargetAlpha-1A adrenergic receptor
LigandBDBM50001786
Substrate/Competitorn/a
Meas. Tech.ChEMBL_33584 (CHEMBL647135)
Ki 0.37±n/a nM
Citation Balle, TPerregaard, JRamirez, MTLarsen, AKSøby, KKLiljefors, TAndersen, K Synthesis and structure-affinity relationship investigations of 5-heteroaryl-substituted analogues of the antipsychotic sertindole. A new class of highly selective alpha(1) adrenoceptor antagonists. J Med Chem46:265-83 (2003) 
 
Alpha-1A adrenergic receptor
Name:Alpha-1A adrenergic receptor
Type:Enzyme Catalytic Domain
Mol. Mass.:51492.08
Organism:CALF
Description:adrenergic Alpha1 0 CALF
Residue:466
BDBM50001786
NameBDBM50001786
Synonyms:1-(2-{4-[5-chloro-1-(4-fluorophenyl)-1H-indol-3-yl]piperidin-1-yl}ethyl)imidazolidin-2-one CHEMBL12713 | Sertindole
TypeSmall organic molecule
Emp. Form.C24H26ClFN4O
Mol. Mass.440.941
SMILESFc1ccc(cc1)-n1cc(C2CCN(CCN3CCNC3=O)CC2)c2cc(Cl)ccc12