Reaction Details
TargetAlpha-1B adrenergic receptor
LigandBDBM50122826
Substrate/Competitorn/a
Meas. Tech.ChEMBL_34197 (CHEMBL649214)
Ki 0.46±n/a nM
Citation Balle, TPerregaard, JRamirez, MTLarsen, AKSøby, KKLiljefors, TAndersen, K Synthesis and structure-affinity relationship investigations of 5-heteroaryl-substituted analogues of the antipsychotic sertindole. A new class of highly selective alpha(1) adrenoceptor antagonists. J Med Chem46:265-83 (2003) 
 
Alpha-1B adrenergic receptor
Name:Alpha-1B adrenergic receptor
Type:Enzyme Catalytic Domain
Mol. Mass.:56514.13
Organism:C.H.O.
Description:adrenergic Alpha1B ADRA1B C.H.O.::P18841
Residue:515
BDBM50122826
NameBDBM50122826
Synonyms:(Cyclazosin)[4-(4-Amino-6,7-dimethoxy-quinazolin-2-yl)-octahydro-quinoxalin-1-yl]-furan-2-yl-methanone [4-(4-Amino-6,7-dimethoxy-quinazolin-2-yl)-octahydro-quinoxalin-1-yl]-furan-2-yl-methanone
TypeSmall organic molecule
Emp. Form.C23H27N5O4
Mol. Mass.437.4916
SMILESCOc1cc2nc(nc(N)c2cc1OC)N1CCN(C2CCCCC12)C(=O)c1ccco1