Reaction Details
TargetDelta-type opioid receptor
LigandBDBM50122862
Substrate/Competitorn/a
Meas. Tech.ChEMBL_145467 (CHEMBL751254)
Ki 21±n/a nM
Citation Black, SLJales, ARBrandt, WLewis, JWHusbands, SM The role of the side chain in determining relative delta- and kappa-affinity in C5'-substituted analogues of naltrindole. J Med Chem46:314-7 (2003) 
 
Delta-type opioid receptor
Name:Delta-type opioid receptor
Type:G Protein-Coupled Receptor (GPCR)
Mol. Mass.:40382.98
Organism:Homo sapiens (Human)
Description:Competition binding assays were carried out using membrane preparations from transfected HN9.10 cells that constitutively expressed the delta opioid receptor.
Residue:372
BDBM50122862
NameBDBM50122862
Synonyms:22-cyclopropylmethyl-7-[2-(1-iminoethylamino)ethyl]-14-oxa-11,22-diazaheptacyclo[13.9.1.01,13.02,21.04,12.05,10.019,25]pentacosa-4(12),5(10),6,8,15,17,19(25)-heptaene-2,16-diol CHEMBL91683
TypeSmall organic molecule
Emp. Form.C30H34N4O3
Mol. Mass.498.616
SMILESCC(=N)NCCc1ccc2[nH]c3[C@@H]4Oc5c6c(CC7N(CC8CC8)CC[C@@]46[C@@]7(O)Cc3c2c1)ccc5O