Reaction Details
TargetKappa-type opioid receptor
LigandBDBM50122852
Substrate/Competitorn/a
Meas. Tech.ChEMBL_145234 (CHEMBL755685)
Ki 0.850000±n/a nM
Citation Black, SLJales, ARBrandt, WLewis, JWHusbands, SM The role of the side chain in determining relative delta- and kappa-affinity in C5'-substituted analogues of naltrindole. J Med Chem46:314-7 (2003) 
 
Kappa-type opioid receptor
Name:Kappa-type opioid receptor
Type:G Protein-Coupled Receptor (GPCR)
Mol. Mass.:42648.76
Organism:Homo sapiens (Human)
Description:P41145
Residue:380
BDBM50122852
NameBDBM50122852
Synonyms:1N-{2-[22-cyclopropylmethyl-2,16-dihydroxy-14-oxa-11,22-diazaheptacyclo[13.9.1.01,13.02,21.04,12.05,10.019,25]pentacosa-4(12),5(10),6,8,15,17,19(25)-heptaen-7-yl]ethyl}butanamide | CHEMBL110487
TypeSmall organic molecule
Emp. Form.C32H37N3O4
Mol. Mass.527.6539
SMILESCCCC(=O)NCCc1ccc2[nH]c3[C@@H]4Oc5c6c(CC7N(CC8CC8)CC[C@@]46[C@@]7(O)Cc3c2c1)ccc5O