Reaction Details
TargetMu-type opioid receptor
LigandBDBM50122851
Substrate/Competitorn/a
Meas. Tech.ChEMBL_148089 (CHEMBL751571)
Ki 4.6±n/a nM
Citation Black, SLJales, ARBrandt, WLewis, JWHusbands, SM The role of the side chain in determining relative delta- and kappa-affinity in C5'-substituted analogues of naltrindole. J Med Chem46:314-7 (2003) 
 
Mu-type opioid receptor
Name:Mu-type opioid receptor
Type:G Protein-Coupled Receptor (GPCR)
Mol. Mass.:44789.51
Organism:Homo sapiens (Human)
Description:P35372
Residue:400
BDBM50122851
NameBDBM50122851
Synonyms:7N-(4-methoxybenzyl)-22-cyclopropylmethyl-2,16-dihydroxy-14-oxa-11,22-diazaheptacyclo[13.9.1.01,13.02,21.04,12.05,10.019,25]pentacosa-4(12),5(10),6,8,15,17,19(25)-heptaene-7-carboxamide | CHEMBL431060
TypeSmall organic molecule
Emp. Form.C35H35N3O5
Mol. Mass.577.6695
SMILESCOc1ccc(CNC(=O)c2ccc3[nH]c4[C@@H]5Oc6c7c(CC8N(CC9CC9)CC[C@@]57[C@@]8(O)Cc4c3c2)ccc6O)cc1