Reaction Details
TargetBeta-lactamase
LigandBDBM50065297
Substrate/Competitorn/a
Meas. Tech.ChEMBL_40260 (CHEMBL877274)
IC50 6000±n/a nM
Citation McGovern, SLHelfand, BTFeng, BShoichet, BK A specific mechanism of nonspecific inhibition. J Med Chem46:4265-72 (2003) 
 
Beta-lactamase
Name:Beta-lactamase
Type:Protien
Mol. Mass.:41561.62
Organism:Escherichia coli
Description:P00811
Residue:377
BDBM50065297
NameBDBM50065297
Synonyms:3-(4-Isopropyl-benzylidene)-1,3-dihydro-indol-2-one CHEMBL48760
TypeSmall organic molecule
Emp. Form.C18H17NO
Mol. Mass.263.3337
SMILESCC(C)c1ccc(\C=C2\C(=O)Nc3ccccc23)cc1