Reaction Details
TargetD(3) dopamine receptor
LigandBDBM50007518
Substrate/Competitorn/a
Meas. Tech.ChEMBL_62279 (CHEMBL675049)
Ki 0.16±n/a nM
Citation Varady, JWu, XFang, XMin, JHu, ZLevant, BWang, S Molecular modeling of the three-dimensional structure of dopamine 3 (D3) subtype receptor: discovery of novel and potent D3 ligands through a hybrid pharmacophore- and structure-based database searching approach. J Med Chem46:4377-92 (2003) 
 
D(3) dopamine receptor
Name:D(3) dopamine receptor
Type:n/a
Mol. Mass.:44243.43
Organism:Homo sapiens (Human)
Description:n/a
Residue:400
BDBM50007518
NameBDBM50007518
Synonyms:(S)-3-chloro-5-ethyl-N-((1-ethylpyrrolidin-2-yl)methyl)-6-hydroxy-2-methoxybenzamide 3-Chloro-5-ethyl-N-((S)-1-ethyl-pyrrolidin-2-ylmethyl)-6-hydroxy-2-methoxy-benzamide 3-Chloro-5-ethyl-N-(1-ethyl-pyrrolidin-2-ylmethyl)-6-hydroxy-2-methoxy-benzamide (etichlopride) 3-chloro-5-ethyl-N-{[(2S)-1-ethylpyrrolidin-2-yl]methyl}-6-hydroxy-2-methoxybenzamide ETICLOPRIDE Eticlopride;3-Chloro-5-ethyl-N-(1-ethyl-pyrrolidin-2-ylmethyl)-6-hydroxy-2-methoxy-benzamide
TypeSmall organic molecule
Emp. Form.C17H25ClN2O3
Mol. Mass.340.845
SMILESCCN1CCC[C@H]1CNC(=O)c1c(O)c(CC)cc(Cl)c1OC