Reaction Details
TargetChymotrypsinogen A
LigandBDBM50134035
Substrate/Competitorn/a
Meas. Tech.ChEMBL_49921 (CHEMBL664290)
IC50 250000±n/a nM
Citation Seidler, JMcGovern, SLDoman, TNShoichet, BK Identification and prediction of promiscuous aggregating inhibitors among known drugs. J Med Chem46:4477-86 (2003) 
 
Chymotrypsinogen A
Name:Chymotrypsinogen A
Type:Serine protease
Mol. Mass.:25670.88
Organism:Bos taurus (bovine)
Description:n/a
Residue:245
BDBM50134035
NameBDBM50134035
Synonyms:BENZYL BENZOATE | CHEMBL1239
TypeSmall organic molecule
Emp. Form.C14H12O2
Mol. Mass.212.2439
SMILESO=C(OCc1ccccc1)c1ccccc1