Reaction Details
TargetBeta-lactamase
LigandBDBM50134036
Substrate/Competitorn/a
Meas. Tech.ChEMBL_40567 (CHEMBL651415)
IC50 350000±n/a nM
Citation Seidler, JMcGovern, SLDoman, TNShoichet, BK Identification and prediction of promiscuous aggregating inhibitors among known drugs. J Med Chem46:4477-86 (2003) 
 
Beta-lactamase
Name:Beta-lactamase
Type:Protien
Mol. Mass.:41561.62
Organism:Escherichia coli
Description:P00811
Residue:377
BDBM50134036
NameBDBM50134036
Synonyms:2-(2,3-Dimethyl-phenylamino)-benzoic acid 2-(2,3-dimethylphenylamino)benzoic acid CI-473 INF-3355 Ponstel mefanamic acid
TypeSmall organic molecule
Emp. Form.C15H15NO2
Mol. Mass.241.2851
SMILESCc1cccc(Nc2ccccc2C(O)=O)c1C