Reaction Details
TargetChymotrypsinogen A
LigandBDBM1944
Substrate/Competitorn/a
Meas. Tech.ChEMBL_49921 (CHEMBL664290)
IC50 225000±n/a nM
Citation Seidler, JMcGovern, SLDoman, TNShoichet, BK Identification and prediction of promiscuous aggregating inhibitors among known drugs. J Med Chem46:4477-86 (2003) 
 
Chymotrypsinogen A
Name:Chymotrypsinogen A
Type:Serine protease
Mol. Mass.:25670.88
Organism:Bos taurus (bovine)
Description:n/a
Residue:245
BDBM1944
NameBDBM1944
Synonyms:BHAP deriv. DELAVIRDINE MESYLATE N-[2-({4-[3-(propan-2-ylamino)pyridin-2-yl]piperazin-1-yl}carbonyl)-1H-indol-5-yl]methanesulfonamide U-90152S
TypeSmall organic molecule
Emp. Form.C22H28N6O3S
Mol. Mass.456.561
SMILESCC(C)Nc1cccnc1N1CCN(CC1)C(=O)c1cc2cc(NS(C)(=O)=O)ccc2[nH]1