Reaction Details
TargetChymotrypsinogen A
LigandBDBM31774
Substrate/Competitorn/a
Meas. Tech.ChEMBL_49921 (CHEMBL664290)
IC50 85000±n/a nM
Citation Seidler, JMcGovern, SLDoman, TNShoichet, BK Identification and prediction of promiscuous aggregating inhibitors among known drugs. J Med Chem46:4477-86 (2003) 
 
Chymotrypsinogen A
Name:Chymotrypsinogen A
Type:Serine protease
Mol. Mass.:25670.88
Organism:Bos taurus (bovine)
Description:n/a
Residue:245
BDBM31774
NameBDBM31774
Synonyms:CHEMBL104 Clotrimazole Mycelex cid_2812
TypeSmall organic molecule
Emp. Form.C22H17ClN2
Mol. Mass.344.837
SMILESClc1ccccc1C(c1ccccc1)(c1ccccc1)n1ccnc1