Reaction Details
TargetBeta-lactamase
LigandBDBM50002861
Substrate/Competitorn/a
Meas. Tech.ChEMBL_215904 (CHEMBL820836)
IC50>400000±n/a nM
Citation Seidler, JMcGovern, SLDoman, TNShoichet, BK Identification and prediction of promiscuous aggregating inhibitors among known drugs. J Med Chem46:4477-86 (2003) 
 
Beta-lactamase
Name:Beta-lactamase
Type:Protien
Mol. Mass.:41561.62
Organism:Escherichia coli
Description:P00811
Residue:377
BDBM50002861
NameBDBM50002861
Synonyms:3-(4,5-Diphenyl-oxazol-2-yl)-propionic acid Daypro WY-21743 | oxaprosin
TypeSmall organic molecule
Emp. Form.C18H15NO3
Mol. Mass.293.3166
SMILESOC(=O)CCc1nc(c(o1)-c1ccccc1)-c1ccccc1