Reaction Details
TargetBeta-lactamase
LigandBDBM25817
Substrate/Competitorn/a
Meas. Tech.ChEMBL_40567 (CHEMBL651415)
IC50>400000±n/a nM
Citation Seidler, JMcGovern, SLDoman, TNShoichet, BK Identification and prediction of promiscuous aggregating inhibitors among known drugs. J Med Chem46:4477-86 (2003) 
 
Beta-lactamase
Name:Beta-lactamase
Type:Protien
Mol. Mass.:41561.62
Organism:Escherichia coli
Description:P00811
Residue:377
BDBM25817
NameBDBM25817
Synonyms:2-(2,4-difluorophenyl)-1,3-bis(1H-1,2,4-triazol-1-yl)propan-2-ol Diflucan Fluconazole (f) Triflucan US11247981, Example Fluconazole US9144538, Fluconazole US9556143, Fluconazole | cid_3365
TypeSmall organic molecule
Emp. Form.C13H12F2N6O
Mol. Mass.306.2708
SMILESOC(Cn1cncn1)(Cn1cncn1)c1ccc(F)cc1F