Reaction Details
TargetMalate dehydrogenase, cytoplasmic
LigandBDBM50367298
Substrate/Competitorn/a
Meas. Tech.ChEMBL_104019 (CHEMBL709628)
IC50 50000±n/a nM
Citation Seidler, JMcGovern, SLDoman, TNShoichet, BK Identification and prediction of promiscuous aggregating inhibitors among known drugs. J Med Chem46:4477-86 (2003) 
 
Malate dehydrogenase, cytoplasmic
Name:Malate dehydrogenase, cytoplasmic
Type:PROTEIN
Mol. Mass.:36427.72
Organism:Homo sapiens (Human)
Description:ChEMBL_1456624
Residue:334
BDBM50367298
NameBDBM50367298
Synonyms:Cardene | NICARDIPINE
TypeSmall organic molecule
Emp. Form.C26H29N3O6
Mol. Mass.479.525
SMILESCOC(=O)C1C(C(C(=O)OCCN(C)Cc2ccccc2)=C(C)N=C1C)c1cccc(c1)[N+]([O-])=O