Reaction Details
TargetChymotrypsinogen A
LigandBDBM31773
Substrate/Competitorn/a
Meas. Tech.ChEMBL_49921 (CHEMBL664290)
IC50 150000±n/a nM
Citation Seidler, JMcGovern, SLDoman, TNShoichet, BK Identification and prediction of promiscuous aggregating inhibitors among known drugs. J Med Chem46:4477-86 (2003) 
 
Chymotrypsinogen A
Name:Chymotrypsinogen A
Type:Serine protease
Mol. Mass.:25670.88
Organism:Bos taurus (bovine)
Description:n/a
Residue:245
BDBM31773
NameBDBM31773
Synonyms:ECONAZOLE Gyno-pevaryl cid_68589
TypeSmall organic molecule
Emp. Form.C18H15Cl3N2O
Mol. Mass.381.684
SMILESClc1ccc(COC(Cn2ccnc2)c2ccc(Cl)cc2Cl)cc1