Reaction Details
TargetC-C chemokine receptor type 5
LigandBDBM50134046
Substrate/Competitorn/a
Meas. Tech.ChEMBL_39639 (CHEMBL649945)
Ki 0.1±n/a nM
Citation Debnath, AK Generation of predictive pharmacophore models for CCR5 antagonists: study with piperidine- and piperazine-based compounds as a new class of HIV-1 entry inhibitors. J Med Chem46:4501-15 (2003) 
 
C-C chemokine receptor type 5
Name:C-C chemokine receptor type 5
Type:Enzyme
Mol. Mass.:40540.21
Organism:Homo sapiens (Human)
Description:P51681
Residue:352
BDBM50134046
NameBDBM50134046
Synonyms:(4-{(4-Bromo-phenyl)-[(E)-ethoxyimino]-methyl}-4'-methyl-[1,4']bipiperidinyl-1'-yl)-(2,6-dimethyl-4-pyridin-4-yl-phenyl)-methanone | CHEMBL140484
TypeSmall organic molecule
Emp. Form.C34H41BrN4O2
Mol. Mass.617.619
SMILESCCO\N=C(/C1CCN(CC1)C1(C)CCN(CC1)C(=O)c1c(C)cc(cc1C)-c1ccncc1)c1ccc(Br)cc1