Reaction Details
TargetC-C chemokine receptor type 5
LigandBDBM50134054
Substrate/Competitorn/a
Meas. Tech.ChEMBL_39639 (CHEMBL649945)
Ki 0.3±n/a nM
Citation Debnath, AK Generation of predictive pharmacophore models for CCR5 antagonists: study with piperidine- and piperazine-based compounds as a new class of HIV-1 entry inhibitors. J Med Chem46:4501-15 (2003) 
 
C-C chemokine receptor type 5
Name:C-C chemokine receptor type 5
Type:Enzyme
Mol. Mass.:40540.21
Organism:Homo sapiens (Human)
Description:P51681
Residue:352
BDBM50134054
NameBDBM50134054
Synonyms:(4-{(4-Bromo-phenyl)-[(E)-ethoxyimino]-methyl}-4'-methyl-[1,4']bipiperidinyl-1'-yl)-(3,5-dibromo-pyridin-4-yl)-methanone | CHEMBL335365
TypeSmall organic molecule
Emp. Form.C26H31Br3N4O2
Mol. Mass.671.262
SMILESCCO\N=C(/C1CCN(CC1)C1(C)CCN(CC1)C(=O)c1c(Br)cncc1Br)c1ccc(Br)cc1