Reaction Details
TargetNuclear receptor subfamily 1 group I member 3
LigandBDBM50134722
Substrate/Competitorn/a
Meas. Tech.ChEMBL_48049 (CHEMBL666774)
IC50 250±n/a nM
Citation Jyrkkärinne, JMäkinen, JGynther, JSavolainen, HPoso, AHonkakoski, P Molecular determinants of steroid inhibition for the mouse constitutive androstane receptor. J Med Chem46:4687-95 (2003) 
 
Nuclear receptor subfamily 1 group I member 3
Name:Nuclear receptor subfamily 1 group I member 3
Type:PROTEIN
Mol. Mass.:40922.30
Organism:Mus musculus
Description:ChEMBL_48051
Residue:358
BDBM50134722
NameBDBM50134722
Synonyms:5alpha-androst-16-en-3alpha-ol | CHEMBL142348
TypeSmall organic molecule
Emp. Form.C19H30O
Mol. Mass.274.4409
SMILESC[C@]12CC[C@H]3[C@@H](CC[C@H]4C[C@H](O)CC[C@]34C)[C@@H]1CC=C2