Reaction Details
TargetReverse transcriptase/RNaseH
LigandBDBM50134783
Substrate/Competitorn/a
Meas. Tech.ChEMBL_164502 (CHEMBL771478)
Ki 52000±n/a nM
Citation Wang, RHarada, SMitsuya, HZemlicka, J Inhibition of human immunodeficiency virus reverse transcriptase by synadenol triphosphate and its E-isomer. J Med Chem46:4799-802 (2003) 
 
Reverse transcriptase/RNaseH
Name:Reverse transcriptase/RNaseH
Type:PROTEIN
Mol. Mass.:65229.15
Organism:Human immunodeficiency virus 1
Description:ChEMBL_1473730
Residue:566
BDBM50134783
NameBDBM50134783
Synonyms:6-amino-9-[(E)-(2-{[(1,2,3,3-tetrahydroxy-1,2,3-trioxidotriphosphanyl)oxy]methyl}cyclopropylidene)methyl]-9H-purine | CHEMBL145474
TypeSmall organic molecule
Emp. Form.C10H14N5O8P3
Mol. Mass.425.1681
SMILESNc1ncnc2n(\C=C3/CC3COP(O)(=O)P(O)(=O)P(O)(O)=O)cnc12