Reaction Details
TargetReverse transcriptase/RNaseH
LigandBDBM50164644
Substrate/Competitorn/a
Meas. Tech.ChEMBL_164502 (CHEMBL771478)
Ki 500±n/a nM
Citation Wang, RHarada, SMitsuya, HZemlicka, J Inhibition of human immunodeficiency virus reverse transcriptase by synadenol triphosphate and its E-isomer. J Med Chem46:4799-802 (2003) 
 
Reverse transcriptase/RNaseH
Name:Reverse transcriptase/RNaseH
Type:PROTEIN
Mol. Mass.:65229.15
Organism:Human immunodeficiency virus 1
Description:ChEMBL_1473730
Residue:566
BDBM50164644
NameBDBM50164644
Synonyms:2',3'-Dideoxyadenosine Triphosphate (Ddatp) ATP,2',3'-dideoxy [[[5-(6-amino-9H-purin-9-yl)tetrahydrofuran-2-yl]methoxy-hydroxy-phosphoryl]oxy-hydroxy-phosphoryl]oxyphosphonic acid ddATP
TypeSmall organic molecule
Emp. Form.C10H16N5O11P3
Mol. Mass.475.1822
SMILESNc1ncnc2n(cnc12)[C@H]1CC[C@@H](COP(O)(=O)OP(O)(=O)OP(O)(O)=O)O1