Reaction Details
TargetHistone deacetylase 2b
LigandBDBM19130
Substrate/Competitorn/a
Meas. Tech.ChEMBL_87878 (CHEMBL697300)
IC50 7.2±n/a nM
Citation Mai, AMassa, SPezzi, RRotili, DLoidl, PBrosch, G Discovery of (aryloxopropenyl)pyrrolyl hydroxyamides as selective inhibitors of class IIa histone deacetylase homologue HD1-A. J Med Chem46:4826-9 (2003) 
 
Histone deacetylase 2b
Name:Histone deacetylase 2b
Synonyms:Histone deacetylase HD2
Type:PROTEIN
Mol. Mass.:30785.07
Organism:Zea mays
Description:ChEMBL_87549
Residue:286
BDBM19130
NameBDBM19130
TypeSmall organic molecule
Emp. Form.C17H22N2O3
Mol. Mass.302.3682
SMILESCC(C=CC(=O)NO)C=C(C)C(=O)c1ccc(cc1)N(C)C