Reaction Details
TargetAdenosine receptor A2a
LigandBDBM50090850
Substrate/Competitorn/a
Meas. Tech.ChEMBL_31359 (CHEMBL644651)
Ki 407±n/a nM
Citation Kim, SKGao, ZGVan Rompaey, PGross, ASChen, AVan Calenbergh, SJacobson, KA Modeling the adenosine receptors: comparison of the binding domains of A2A agonists and antagonists. J Med Chem46:4847-59 (2003) 
 
Adenosine receptor A2a
Name:Adenosine receptor A2a
Type:G Protein-Coupled Receptor (GPCR)
Mol. Mass.:44716.46
Organism:Homo sapiens (Human)
Description:P29274
Residue:412
BDBM50090850
NameBDBM50090850
Synonyms:(2R,3S,4R,5R)-2-Aminomethyl-5-(6-amino-purin-9-yl)-tetrahydro-furan-3,4-diol 5'-amino-5'-deoxyadenosine | CHEMBL302376
TypeSmall organic molecule
Emp. Form.C10H14N6O3
Mol. Mass.266.2566
SMILESNC[C@H]1O[C@H]([C@H](O)[C@@H]1O)n1cnc2c(N)ncnc12