Reaction Details
TargetDipeptidyl peptidase 2
LigandBDBM11464
Substrate/Competitorn/a
Meas. Tech.ChEMBL_53369 (CHEMBL666615)
Ki 8170±n/a nM
Citation Senten, KVan der Veken, PDe Meester, ILambeir, AMScharpé, SHaemers, AAugustyns, K Design, synthesis, and SAR of potent and selective dipeptide-derived inhibitors for dipeptidyl peptidases. J Med Chem46:5005-14 (2003) 
 
Dipeptidyl peptidase 2
Name:Dipeptidyl peptidase 2
Type:Protein
Mol. Mass.:54339.29
Organism:Homo sapiens (Human)
Description:Q9UHL4
Residue:492
BDBM11464
NameBDBM11464
Synonyms:(2S,3S)-2-amino-3-methyl-1-(1,3-thiazolidin-3-yl)pentan-1-one CHEMBL98408 thiazolidide 2
TypeSmall organic molecule
Emp. Form.C9H18N2OS
Mol. Mass.202.317
SMILESCC[C@H](C)[C@H](N)C(=O)N1CCSC1